bugGTKtalog - Bugs: bug #14655, GTKtalog 1.0.4 dumps when trying...

 
 

bug #14655: GTKtalog 1.0.4 dumps when trying to "Create Report"

Submitted by:  None
Submitted on:  Tue 27 Sep 2005 10:58:26 PM UTC  
 
Category: ReportSeverity: 3 - Normal
Item Group: NoneStatus: Need Info
Privacy: PublicAssigned to: Wilfried Kopp <chevdor>
Originator Email: -unavailable-Open/Closed: Open
Fixed Release: None

Add a New Comment (Rich MarkupRich Markup):
   

You are not logged in

Please log in, so followups can be emailed to you.

 

Fri 14 Oct 2005 09:23:03 PM UTC, comment #2:

using debian etch/gcc4 & gcc3

Not sure what dependancies are not being met

configured fine, but when attempting make make, get these errors;

make
make all-recursive
make[1]: Entering directory `/home/rodney/waste/gtktalog-1.0.5pre1'
Making all in m4
make[2]: Entering directory `/home/rodney/waste/gtktalog-1.0.5pre1/m4'
make[2]: Nothing to be done for `all'.
make[2]: Leaving directory `/home/rodney/waste/gtktalog-1.0.5pre1/m4'
Making all in po
make[2]: Entering directory `/home/rodney/waste/gtktalog-1.0.5pre1/po'
make[2]: Nothing to be done for `all'.
make[2]: Leaving directory `/home/rodney/waste/gtktalog-1.0.5pre1/po'
Making all in src
make[2]: Entering directory `/home/rodney/waste/gtktalog-1.0.5pre1/src'
Making all in gtktalog
make[3]: Entering directory `/home/rodney/waste/gtktalog-1.0.5pre1/src/gtktalog'
Making all in icons
make[4]: Entering directory `/home/rodney/waste/gtktalog-1.0.5pre1/src/gtktalog/icons'
make[4]: Nothing to be done for `all'.
make[4]: Leaving directory `/home/rodney/waste/gtktalog-1.0.5pre1/src/gtktalog/icons'
Making all in xpm
make[4]: Entering directory `/home/rodney/waste/gtktalog-1.0.5pre1/src/gtktalog/xpm'
make[4]: Nothing to be done for `all'.
make[4]: Leaving directory `/home/rodney/waste/gtktalog-1.0.5pre1/src/gtktalog/xpm'
make[4]: Entering directory `/home/rodney/waste/gtktalog-1.0.5pre1/src/gtktalog'
if gcc -DHAVE_CONFIG_H -DLOCALEDIR=\"/usr/local/share/locale\" -I. -I. -I../.. -I../..-I/usr/local/include -DG_LOG_DOMAIN=\"gtktalog\" -DGETTEXT_PACKAGE=\"gtktalog\" -DGNOMELOCALEDIR=\""/usr/local/share/locale"\" -DPREFIX=\"/usr/local\" -DDATA_DIR=\"/usr/local/share\" -DOS_LINUX -g -O2 -MT interface.o -MD -MP -MF ".deps/interface.Tpo" \
-c -o interface.o `test -f 'interface.c' || echo './'`interface.c; \
then mv -f ".deps/interface.Tpo" ".deps/interface.Po"; \
else rm -f ".deps/interface.Tpo"; exit 1; \
fi
interface.c:27:19: gnome.h: No such file or directory
interface.c:29:45: libgnomevfs/gnome-vfs-mime-info.h: No such file or directory
In file included from interface.c:42:
buttonbar.h:23:19: gnome.h: No such file or directory
In file included from buttonbar.h:24,
from interface.c:42:
config_common.h:23:19: gnome.h: No such file or directory
In file included from buttonbar.h:24,
from interface.c:42:
config_common.h:136: error: syntax error before "GPtrArray"
config_common.h:136: warning: no semicolon at end of struct or union
config_common.h:137: warning: data definition has no type or storage class
config_common.h:139: error: syntax error before '*' token
config_common.h:139: warning: data definition has no type or storage class
config_common.h:140: error: syntax error before '*' token
config_common.h:140: warning: data definition has no type or storage class
config_common.h:142: error: syntax error before '*' token
config_common.h:142: warning: data definition has no type or storage class
config_common.h:143: error: syntax error before "ctree_tree_expand_signal_id"
config_common.h:143: warning: data definition has no type or storage class
config_common.h:145: error: syntax error before '*' token
config_common.h:145: warning: data definition has no type or storage class
config_common.h:146: error: syntax error before '*' token
config_common.h:146: warning: data definition has no type or storage class
config_common.h:148: error: syntax error before "is_modified"
config_common.h:148: warning: data definition has no type or storage class
config_common.h:150: error: syntax error before '*' token
config_common.h:150: warning: data definition has no type or storage class
config_common.h:151: error: syntax error before "catalog_filename_is_valid"
config_common.h:151: warning: data definition has no type or storage class
config_common.h:153: warning: data definition has no type or storage class
config_common.h:157: error: syntax error before "guint32"
config_common.h:157: warning: no semicolon at end of struct or union
config_common.h:158: warning: data definition has no type or storage class
config_common.h:159: error: syntax error before "taille"
config_common.h:159: warning: data definition has no type or storage class
config_common.h:160: error: syntax error before "type"
config_common.h:160: warning: data definition has no type or storage class
config_common.h:162: error: syntax error before '*' token
config_common.h:162: warning: data definition has no type or storage class
config_common.h:163: error: syntax error before "categorie"
config_common.h:163: warning: data definition has no type or storage class
config_common.h:164: error: syntax error before "description"
config_common.h:164: warning: data definition has no type or storage class
config_common.h:165: error: syntax error before '*' token
config_common.h:165: warning: data definition has no type or storage class
config_common.h:166: error: syntax error before '*' token
config_common.h:166: warning: data definition has no type or storage class
config_common.h:167: error: syntax error before '*' token
config_common.h:167: warning: data definition has no type or storage class
config_common.h:169: error: syntax error before "a_parent_node_is_vfs"
config_common.h:169: warning: data definition has no type or storage class
config_common.h:173: warning: data definition has no type or storage class
config_common.h:178: error: syntax error before "GdkPixmap"
config_common.h:178: warning: no semicolon at end of struct or union
config_common.h:179: warning: data definition has no type or storage class
config_common.h:180: error: syntax error before '*' token
config_common.h:180: warning: data definition has no type or storage class
config_common.h:181: error: syntax error before "used"
config_common.h:181: warning: data definition has no type or storage class
config_common.h:185: warning: data definition has no type or storage class
config_common.h:189: error: syntax error before "GString"
config_common.h:189: warning: no semicolon at end of struct or union
config_common.h:190: warning: data definition has no type or storage class
config_common.h:191: error: syntax error before '*' token
config_common.h:191: warning: data definition has no type or storage class
config_common.h:192: error: syntax error before "state"
config_common.h:192: warning: data definition has no type or storage class
config_common.h:194: warning: data definition has no type or storage class
config_common.h:198: error: syntax error before "GString"
config_common.h:198: warning: no semicolon at end of struct or union
config_common.h:199: warning: data definition has no type or storage class
config_common.h:200: error: syntax error before '*' token
config_common.h:200: warning: data definition has no type or storage class
config_common.h:201: error: syntax error before '*' token
config_common.h:201: warning: data definition has no type or storage class
config_common.h:202: error: syntax error before "date"
config_common.h:202: error: conflicting types for `date'
config_common.h:161: error: previous declaration of `date'
config_common.h:202: warning: data definition has no type or storage class
config_common.h:203: error: syntax error before '*' token
config_common.h:203: warning: data definition has no type or storage class
config_common.h:204: error: syntax error before "size"
config_common.h:204: warning: data definition has no type or storage class
config_common.h:205: error: syntax error before "name"
config_common.h:205: error: conflicting types for `name'
config_common.h:158: error: previous declaration of `name'
config_common.h:205: warning: data definition has no type or storage class
config_common.h:207: error: syntax error before "state"
config_common.h:207: warning: data definition has no type or storage class
config_common.h:209: warning: data definition has no type or storage class
config_common.h:213: error: syntax error before "gchar"
config_common.h:213: warning: no semicolon at end of struct or union
config_common.h:214: warning: data definition has no type or storage class
config_common.h:215: error: syntax error before '}' token
config_common.h:216: warning: data definition has no type or storage class
config_common.h:227: error: syntax error before "GTree"
config_common.h:227: warning: no semicolon at end of struct or union
config_common.h:228: warning: data definition has no type or storage class
config_common.h:229: error: syntax error before '*' token
config_common.h:229: warning: data definition has no type or storage class
config_common.h:230: error: syntax error before '*' token
config_common.h:230: warning: data definition has no type or storage class
config_common.h:231: error: syntax error before '*' token
config_common.h:231: warning: data definition has no type or storage class
config_common.h:232: error: syntax error before '*' token
config_common.h:232: warning: data definition has no type or storage class
config_common.h:233: error: syntax error before '*' token
config_common.h:233: warning: data definition has no type or storage class
config_common.h:234: error: syntax error before '*' token
config_common.h:234: warning: data definition has no type or storage class
config_common.h:235: error: syntax error before '*' token
config_common.h:235: warning: data definition has no type or storage class
config_common.h:236: error: syntax error before '*' token
config_common.h:236: warning: data definition has no type or storage class
config_common.h:237: error: syntax error before '*' token
config_common.h:237: warning: data definition has no type or storage class
config_common.h:238: error: syntax error before '*' token
config_common.h:238: warning: data definition has no type or storage class
config_common.h:240: error: syntax error before '*' token
config_common.h:240: warning: data definition has no type or storage class
config_common.h:242: error: syntax error before "getInformation"
config_common.h:242: warning: data definition has no type or storage class
config_common.h:243: error: syntax error before "testvfs"
config_common.h:243: warning: data definition has no type or storage class
config_common.h:245: error: syntax error before '*' token
config_common.h:245: warning: data definition has no type or storage class
config_common.h:246: error: syntax error before "update_edit_window"
config_common.h:246: warning: data definition has no type or storage class
config_common.h:247: error: syntax error before "category_widgets"
config_common.h:247: warning: data definition has no type or storage class
config_common.h:248: error: syntax error before "search_widgets"
config_common.h:248: warning: data definition has no type or storage class
config_common.h:249: error: syntax error before "calendar_widgets"
config_common.h:249: warning: data definition has no type or storage class
config_common.h:251: error: syntax error before '*' token
config_common.h:251: warning: data definition has no type or storage class
config_common.h:255: error: syntax error before '*' token
config_common.h:255: warning: data definition has no type or storage class
config_common.h:256: error: syntax error before '*' token
config_common.h:256: warning: data definition has no type or storage class
config_common.h:257: error: syntax error before '*' token
config_common.h:257: warning: data definition has no type or storage class
config_common.h:258: error: syntax error before '*' token
config_common.h:258: warning: data definition has no type or storage class
config_common.h:259: error: syntax error before '*' token
config_common.h:259: warning: data definition has no type or storage class
config_common.h:260: error: syntax error before '*' token
config_common.h:260: warning: data definition has no type or storage class
config_common.h:261: error: syntax error before "use_sudo"
config_common.h:261: warning: data definition has no type or storage class
config_common.h:262: error: syntax error before '*' token
config_common.h:262: warning: data definition has no type or storage class
config_common.h:263: error: syntax error before "use_supermount"
config_common.h:263: warning: data definition has no type or storage class
config_common.h:264: error: syntax error before "use_automount"
config_common.h:264: warning: data definition has no type or storage class
config_common.h:265: error: syntax error before "mount_retry"
config_common.h:265: warning: data definition has no type or storage class
make[4]: *** [interface.o] Interrupt
make[3]: *** [all-recursive] Interrupt
make[2]: *** [all-recursive] Interrupt
make[1]: *** [all-recursive] Interrupt
make: *** [all] Interrupt

Anonymous
Fri 30 Sep 2005 07:33:50 PM UTC, comment #1:

Could you please try with release 1.0.5 and let me know the result please ?
You can get it from http://chevdor.homelinux.com/gtktalog/

Wilfried Kopp <chevdor>
Project AdministratorIn charge of this item.
Tue 27 Sep 2005 10:58:26 PM UTC, original submission:

I'm running Debian etch/testing, and GTKtalog 1.0.4

I have cdrom/music database installed. When I attempt to "Create Report" from the menu button, GTKtalog crashes.

This is what I get when running with gdb;

gdb gtktalog
GNU gdb 6.3-debian
Copyright 2004 Free Software Foundation, Inc.
GDB is free software, covered by the GNU General Public License, and you are
welcome to change it and/or distribute copies of it under certain conditions.
Type "show copying" to see the conditions.
There is absolutely no warranty for GDB. Type "show warranty" for details.
This GDB was configured as "i386-linux"...(no debugging symbols found)
Using host libthread_db library "/lib/tls/libthread_db.so.1".

(gdb) run
Starting program: /usr/bin/gtktalog
(no debugging symbols found)
(no debugging symbols found)
(no debugging symbols found)
(no debugging symbols found)
(no debugging symbols found)
(no debugging symbols found)
(no debugging symbols found)
(no debugging symbols found)
(no debugging symbols found)
(no debugging symbols found)
(no debugging symbols found)
(no debugging symbols found)
(no debugging symbols found)
(no debugging symbols found)
(no debugging symbols found)
(no debugging symbols found)
(no debugging symbols found)
(no debugging symbols found)
(no debugging symbols found)
(no debugging symbols found)
(no debugging symbols found)
(no debugging symbols found)
[Thread debugging using libthread_db enabled]
[New Thread -1215317248 (LWP 4821)]
(no debugging symbols found)
(no debugging symbols found)
(no debugging symbols found)
(no debugging symbols found)
---Type <return> to continue, or q <return> to quit---
(no debugging symbols found)
(no debugging symbols found)
(no debugging symbols found)
(no debugging symbols found)
(no debugging symbols found)
(no debugging symbols found)
(no debugging symbols found)
(no debugging symbols found)
(no debugging symbols found)
(no debugging symbols found)
(no debugging symbols found)
(no debugging symbols found)
Gdk-ERROR **: BadAlloc (insufficient resources for operation)
serial 12138 error_code 11 request_code 53 minor_code 0
Gdk-ERROR **: BadAlloc (insufficient resources for operation)
serial 12139 error_code 11 request_code 53 minor_code 0

Program exited with code 01.(gdb) bt full
No stack.

When I attempt to run "bt full" to see what is happening, this is what I get;

(gdb) bt full
No stack.

Anonymous

 

(Note: upload size limit is set to 16384 kB, after insertion of the required escape characters.)

Attach File(s):
   
   
Comment:
   

No files currently attached

 

Depends on the following items: None found

Items that depend on this one: None found

 

CC list is empty

 

Do you think this task is very important?
If so, you can click here to add your encouragement to it.
This task has 0 encouragements so far.

Only logged-in users can vote.

 

Please enter the title of George Orwell's famous dystopian book (it's a date):

 

 

Follow 2 latest changes.

Date Changed By Updated Field Previous Value => Replaced By
Fri 30 Sep 2005 07:32:17 PM UTCchevdorStatusNone=>Need Info
  Assigned toNone=>chevdor

Back to the top


Powered by Savane 3.1-cleanup