helpFreeFEM3D - Support: sr #107579, Compile on SUSE11.3, Fedora 12, 13...


sr #107579: Compile on SUSE11.3, Fedora 12, 13 and 14, and FreeBSD 8.1 fails

Submitted by:  None
Submitted on:  Tue 25 Jan 2011 12:25:34 AM UTC  
Category:  None Priority:  5 - Normal
Severity:  4 - Important Status:  None
Privacy:  Public Assigned to:  None
Originator Email:  -email is unavailable- Open/Closed:  Open
Operating System:  GNU/Linux

Add a New Comment (Rich Markup)

You are not logged in

Please log in, so followups can be emailed to you.


Tue 25 Jan 2011 12:25:34 AM UTC, original submission:  

make[3]: Entering directory `/home/johnj/Downloads/freefem3d/language'
if g++ -DHAVE_CONFIG_H -I. -I. -I..   -I.. -I../solver -I../algebra -I../geometry -I../utils -I../language -I../graphics  -g -O2 -Wall -DNDEBUG -MT FFLexer.o -MD -MP -MF ".deps/FFLexer.Tpo" -c -o FFLexer.o FFLexer.cpp; \
then mv -f ".deps/FFLexer.Tpo" ".deps/FFLexer.Po"; else rm -f ".deps/FFLexer.Tpo"; exit 1; fi
FFLexer.cpp: In member function ‘virtual int FFLexer::yylex()’:
FFLexer.cpp:667:12: error: ‘EOF’ was not declared in this scope
make[3]: *** [FFLexer.o] Error 1
make[3]: Leaving directory `/home/johnj/Downloads/freefem3d/language'
make[2]: *** [all] Error 2
make[2]: Leaving directory `/home/johnj/Downloads/freefem3d/language'
make[1]: *** [all-recursive] Error 1
make[1]: Leaving directory `/home/johnj/Downloads/freefem3d'
make: *** [all] Error 2



(Note: upload size limit is set to 16384 kB, after insertion of the required escape characters.)

Attach Files:

No files currently attached


Depends on the following items: None found

Items that depend on this one: None found


Carbon-Copy List
  • -email is unavailable- added by None (Submitted the item)

    Do you think this task is very important?
    If so, you can add your encouragement to it.
    This task has 0 encouragements so far.

    Only logged-in users can vote.




    No changes have been made to this item

    Back to the top

    Powered by Savane 3.5