helpMobius Forensic Toolkit - Support: sr #109030, Problema instalación mobius 0.5.24

 
 

sr #109030: Problema instalación mobius 0.5.24

Submitted by:  None
Submitted on:  Wed 04 May 2016 08:08:18 AM UTC  
 
Category:  None Priority:  5 - Normal
Severity:  3 - Normal Status:  None
Privacy:  Public Assigned to:  None
Originator Email:  -email is unavailable- Open/Closed:  Open
Operating System:  GNU/Linux

Add a New Comment (Rich Markup)
   

You are not logged in

Please log in, so followups can be emailed to you.

 

Wed 04 May 2016 08:08:18 AM UTC, original submission:  

sistema operativo Ubuntu 16.04.
sleuthkit instalado de repositorios
python actualizado
Tras ejecutar "make" aparece el siguiente error:

collect2: error: ld returned 1 exit status
Makefile:392: fallo en las instrucciones para el objetivo 'tsk'
make[3]: *** [tsk] Error 1
make[3]: se sale del directorio '/home/rdos/Descargas/mobiusft-0.5.24/examples/cpp'
Makefile:351: fallo en las instrucciones para el objetivo 'all-recursive'
make[2]: *** [all-recursive] Error 1
make[2]: se sale del directorio '/home/rdos/Descargas/mobiusft-0.5.24/examples'
Makefile:503: fallo en las instrucciones para el objetivo 'all-recursive'
make[1]: *** [all-recursive] Error 1
make[1]: se sale del directorio '/home/rdos/Descargas/mobiusft-0.5.24'
Makefile:362: fallo en las instrucciones para el objetivo 'all'
make: *** [all] Error 2

Anonymous

 

(Note: upload size limit is set to 16384 kB, after insertion of the required escape characters.)

Attach Files:
   
   
Comment:
   

No files currently attached

 

Depends on the following items: None found

Items that depend on this one: None found

 

Carbon-Copy List
  • -email is unavailable- added by None (Submitted the item)
  •  

    Do you think this task is very important?
    If so, you can add your encouragement to it.
    This task has 0 encouragements so far.

    Only logged-in users can vote.

     

     

     

    No changes have been made to this item

    Back to the top


    Powered by Savane 3.5