bugSwinput - Bugs: bug #27408, swinput-0.7.1 build failure

 
 

bug #27408: swinput-0.7.1 build failure

Submitted by:  None
Submitted on:  Wed 09 Sep 2009 07:31:47 AM UTC  
 
Category:  None Severity:  5 - Blocker
Item Group:  None Status:  Fixed
Privacy:  Public Assigned to:  Henrik Sandklef <hesa>
Open/Closed:  Open

Add a New Comment(Rich Markup)
   

You are not logged in

Please log in, so followups can be emailed to you.

 

Thu 24 Sep 2009 03:13:12 AM UTC, comment #1:

Oops, it appears this is the second error that I mentioned in the
other bug. I forgot I had posted that, sorry.

Anonymous
Wed 09 Sep 2009 07:31:47 AM UTC, original submission:

Compile fails for swinput:

ProximaCentauri swinput-0.7.1 # make
cd src && make -C /lib/modules/2.6.27-gentoo-r7/build SUBDIRS=/var/tmp/portage/app-misc/swinput-0.7.1/work/swinput-0.7.1/src modules
make[1]: Entering directory `/usr/src/linux-2.6.27-gentoo-r7'
scripts/Makefile.build:46: *** CFLAGS was changed in "/var/tmp/portage/app-misc/swinput-0.7.1/work/swinput-0.7.1/src/Makefile". Fix it to use EXTRA_CFLAGS. Stop.
make[1]: *** [_module_/var/tmp/portage/app-misc/swinput-0.7.1/work/swinput-0.7.1/src] Error 2
make[1]: Leaving directory `/usr/src/linux-2.6.27-gentoo-r7'
make: *** [default] Error 2

Setting KBUILD_NOPEDANTIC still fails:
ProximaCentauri swinput-0.7.1 # KBUILD_NOPEDANTIC=1 make
cd src && make -C /lib/modules/2.6.27-gentoo-r7/build SUBDIRS=/var/tmp/portage/a
pp-misc/swinput-0.7.1/work/swinput-0.7.1/src modules
make[1]: Entering directory `/usr/src/linux-2.6.27-gentoo-r7'
CC [M] /var/tmp/portage/app-misc/swinput-0.7.1/work/swinput-0.7.1/src/swmouse
.o
/var/tmp/portage/app-misc/swinput-0.7.1/work/swinput-0.7.1/src/swmouse.c: In fun
ction ‘init_module’:
/var/tmp/portage/app-misc/swinput-0.7.1/work/swinput-0.7.1/src/swmouse.c:172: er
ror: implicit declaration of function ‘LONG’
/var/tmp/portage/app-misc/swinput-0.7.1/work/swinput-0.7.1/src/swmouse.c:172: wa
rning: left shift count >= width of type
/var/tmp/portage/app-misc/swinput-0.7.1/work/swinput-0.7.1/src/swmouse.c:172: wa
rning: left shift count >= width of type
/var/tmp/portage/app-misc/swinput-0.7.1/work/swinput-0.7.1/src/swmouse.c:172: wa
rning: left shift count >= width of type
/var/tmp/portage/app-misc/swinput-0.7.1/work/swinput-0.7.1/src/swmouse.c:173: wa
rning: left shift count >= width of type
/var/tmp/portage/app-misc/swinput-0.7.1/work/swinput-0.7.1/src/swmouse.c:179: wa
rning: ignoring return value of ‘input_register_device’, declared with attribute
warn_unused_result
/var/tmp/portage/app-misc/swinput-0.7.1/work/swinput-0.7.1/src/swmouse.c: In fun
ction ‘swmouse_write’:
/var/tmp/portage/app-misc/swinput-0.7.1/work/swinput-0.7.1/src/swmouse.c:365: wa
rning: format ‘%u’ expects type ‘unsigned int’, but argument 2 has type ‘struct
input_dev *’
/var/tmp/portage/app-misc/swinput-0.7.1/work/swinput-0.7.1/src/swmouse.c:374: wa
rning: format ‘%u’ expects type ‘unsigned int’, but argument 2 has type ‘struct
input_dev *’
/var/tmp/portage/app-misc/swinput-0.7.1/work/swinput-0.7.1/src/swmouse.c:253: wa
rning: unused variable ‘i’
/var/tmp/portage/app-misc/swinput-0.7.1/work/swinput-0.7.1/src/swmouse.c:268: wa
rning: ignoring return value of ‘copy_from_user’, declared with attribute warn_u
nused_result
make[2]: *** [/var/tmp/portage/app-misc/swinput-0.7.1/work/swinput-0.7.1/src/swm
ouse.o] Error 1
make[1]: *** [_module_/var/tmp/portage/app-misc/swinput-0.7.1/work/swinput-0.7.1
/src] Error 2
make[1]: Leaving directory `/usr/src/linux-2.6.27-gentoo-r7'
make: *** [default] Error 2

Anonymous

 

(Note: upload size limit is set to 16384 kB, after insertion of the required escape characters.)

Attach Files:
   
   
Comment:
   

No files currently attached

 

Depends on the following items: None found

Items that depend on this one: None found

 

Carbon-Copy List
  • -email is unavailable- added by hesa (Updated the item)
  •  

    Do you think this task is very important?
    If so, you can add your encouragement to it.
    This task has 0 encouragements so far.

    Only logged-in users can vote.

     

     

     

    Follow 3 latest changes.

    Date Changed by Updated Field Previous Value => Replaced by
    2009-10-01 hesa Severity3 - Normal => 5 - Blocker
        StatusNone => Fixed
        Assigned toNone => hesa

    Back to the top


    Powered by Savane 3.3