bugThe Linux Orinoco Driver - Bugs: bug #17958, Unable to compile last cvs against...


bug #17958: Unable to compile last cvs against 2.6.18 kernel

Submitted by:  None
Submitted on:  Tue 10 Oct 2006 04:14:58 AM UTC
Votes:  10  
Category:  None Severity:  3 - Normal
Item Group:  None Status:  None
Privacy:  Public Assigned to:  None
Open/Closed:  Open
* Mandatory Fields

Add a New Comment (Rich Markup)

Comment Type & Canned Response:
       No canned response available


Tue 10 Oct 2006 04:14:58 AM UTC, original submission:  

radical events # emerge =orinoco-9999
Calculating dependencies... done!

>>> Emerging (1 of 1) net-wireless/orinoco-9999 to /

  • checking ebuild checksums ;-) ...                                      [ ok ] * checking auxfile checksums ;-) ...                                     [ ok ] * checking miscfile checksums ;-) ...                                    [ ok ] * Determining the location of the kernel source code
  • Found kernel source directory:
  •     /usr/src/linux
  • Found sources for kernel version:
  •     2.6.16-suspend2-r8
  • Checking for suitable kernel configuration options...                  [ ok ]>>> Unpacking source...
  • Fetching CVS module orinoco into /usr/portage/distfiles/cvs-src ...
  • Running  cvs -q -f -z4 -d ":pserver:anonymous:@cvs.savannah.nongnu.org:/sources/orinoco" login

Logging in to :pserver:anonymous@cvs.savannah.nongnu.org:2401/sources/orinoco

  • Running  cvs -q -f -z4 -d ":pserver:anonymous@cvs.savannah.nongnu.org:/sources/orinoco" update -dP orinoco
  • Copying orinoco from /usr/portage/distfiles/cvs-src ...
  • CVS module orinoco is now in /var/tmp/portage/orinoco-9999/work

>>> Source unpacked.
>>> Compiling source in /var/tmp/portage/orinoco-9999/work/orinoco ...

  • Preparing hermes module

make -C /usr/src/linux M=/var/tmp/portage/orinoco-9999/work/orinoco KERNELRELEASE=2.6.16-suspend2-r8 modules
make[1]: entrant dans le répertoire « /usr/src/linux-2.6.16-suspend2-r8 »
  CC [M]  /var/tmp/portage/orinoco-9999/work/orinoco/orinoco_nortel.o
  CC [M]  /var/tmp/portage/orinoco-9999/work/orinoco/orinoco_pci.o
  CC [M]  /var/tmp/portage/orinoco-9999/work/orinoco/orinoco_plx.o
  CC [M]  /var/tmp/portage/orinoco-9999/work/orinoco/orinoco_tmd.o
  CC [M]  /var/tmp/portage/orinoco-9999/work/orinoco/orinoco_cs.o
  CC [M]  /var/tmp/portage/orinoco-9999/work/orinoco/prism_usb.o
/var/tmp/portage/orinoco-9999/work/orinoco/orinoco_cs.c: In function 'orinoco_cs_attach':
/var/tmp/portage/orinoco-9999/work/orinoco/orinoco_cs.c:175: attention : implicit declaration of function 'pcmcia_register_client'
/var/tmp/portage/orinoco-9999/work/orinoco/orinoco_cs.c: In function 'orinoco_cs_detach':
/var/tmp/portage/orinoco-9999/work/orinoco/orinoco_cs.c:208: attention : implicit declaration of function 'pcmcia_deregister_client'
/var/tmp/portage/orinoco-9999/work/orinoco/orinoco_cs.c: Hors de toute fonction :
/var/tmp/portage/orinoco-9999/work/orinoco/orinoco_cs.c:671: erreur: unknown field 'attach' specified in initializer
/var/tmp/portage/orinoco-9999/work/orinoco/orinoco_cs.c:671: attention : éléments en excès dans l'initialisation de la structure
/var/tmp/portage/orinoco-9999/work/orinoco/orinoco_cs.c:671: attention : (near initialization for 'orinoco_driver')
/var/tmp/portage/orinoco-9999/work/orinoco/orinoco_cs.c:672: erreur: unknown field 'detach' specified in initializer
/var/tmp/portage/orinoco-9999/work/orinoco/orinoco_cs.c:672: attention : éléments en excès dans l'initialisation de la structure
/var/tmp/portage/orinoco-9999/work/orinoco/orinoco_cs.c:672: attention : (near initialization for 'orinoco_driver')
/var/tmp/portage/orinoco-9999/work/orinoco/orinoco_cs.c:674: erreur: unknown field 'event' specified in initializer
/var/tmp/portage/orinoco-9999/work/orinoco/orinoco_cs.c:674: attention : éléments en excès dans l'initialisation de la structure
/var/tmp/portage/orinoco-9999/work/orinoco/orinoco_cs.c:674: attention : (near initialization for 'orinoco_driver')
make[2]: *** [/var/tmp/portage/orinoco-9999/work/orinoco/orinoco_cs.o] Erreur 1
make[2]: *** Attente des tâches non terminées....
/var/tmp/portage/orinoco-9999/work/orinoco/prism_usb.c:464: erreur: unknown field 'owner' specified in initializer
/var/tmp/portage/orinoco-9999/work/orinoco/prism_usb.c:464: attention : initialization from incompatible pointer type
make[2]: *** [/var/tmp/portage/orinoco-9999/work/orinoco/prism_usb.o] Erreur 1
make[1]: *** [_module_/var/tmp/portage/orinoco-9999/work/orinoco] Erreur 2
make[1]: quittant le répertoire « /usr/src/linux-2.6.16-suspend2-r8 »
make: *** [modules] Erreur 2

!!! ERROR: net-wireless/orinoco-9999 failed.
Call stack:
  ebuild.sh, line 1546:   Called dyn_compile
  ebuild.sh, line 937:   Called src_compile
  orinoco-9999.ebuild, line 80:   Called linux-mod_src_compile
  linux-mod.eclass, line 469:   Called die

!!! Unable to make  KERNEL_PATH=/usr/src/linux all.
!!! If you need support, post the topmost build error, and the call stack if relevant.
radical events # emerge --info
Portage 2.1.1 (default-linux/x86/2006.0, gcc-4.1.1, glibc-2.4-r4, 2.6.16-suspend2-r8 i686)
System uname: 2.6.16-suspend2-r8 i686 Intel(R) Pentium(R) 4 Mobile CPU 1.60GHz
Gentoo Base System version 1.12.5
Last Sync: Sat, 07 Oct 2006 17:00:01 +0000
ccache version 2.3 [enabled]
app-admin/eselect-compiler: [Not Present]
dev-java/java-config: [Not Present]
dev-lang/python:     2.4.3-r4
dev-python/pycrypto: 2.0.1-r5
dev-util/ccache:     2.3
dev-util/confcache:  [Not Present]
sys-apps/sandbox:    1.2.17
sys-devel/autoconf:  2.13, 2.59-r7
sys-devel/automake:  1.4_p6, 1.5, 1.6.3, 1.7.9-r1, 1.8.5-r3, 1.9.6-r2
sys-devel/binutils:  2.16.1-r3
sys-devel/gcc-config: 1.3.13-r4
sys-devel/libtool:   1.5.22
virtual/os-headers:  2.6.17-r1
CFLAGS="-march=pentium4 -O2 -pipe -fomit-frame-pointer -funroll-loops"
CONFIG_PROTECT="/etc /usr/share/X11/xkb"
CONFIG_PROTECT_MASK="/etc/env.d /etc/gconf /etc/revdep-rebuild /etc/splash /etc/terminfo"
CXXFLAGS="-march=pentium4 -O2 -pipe -fomit-frame-pointer -funroll-loops -fvisibility-inlines-hidden"
FEATURES="autoconfig ccache distlocks metadata-transfer sandbox sfperms strict"
GENTOO_MIRRORS="http://gentoo.osuosl.org http://www.ibiblio.org/pub/Linux/distributions/gentoo"
LDFLAGS="-Wl,-O1 -Wl,--sort-common -s"
PORTAGE_RSYNC_OPTS="--recursive --links --safe-links --perms --times --compress --force --whole-file --delete --delete-after --stats --timeout=180 --exclude='/distfiles' --exclude='/local' --exclude='/packages'"
USE="X acpi alsa apache2 avi bitmap-fonts cairo cdr cdrom cdsound crypt cups dbus dri dvd dvdread elibc_glibc encode fam fbsplash firefox foomaticdb fortran gif gnome gpm gstreamer gtk gtk2 gvim hal imlib input_devices_evdev input_devices_keyboard input_devices_mouse insecure-savers ipv6 jpeg kernel_linux ldap libwww linguas_fr lm_sensors mad mikmod motif mozsvg mp3 mp4 mpeg mpeg2 ncurses network new-login nls nptl nptlonly ogg opengl pam pcmcia pcre pdf pdflib perl pic png pnp ppds pppd python quicktime readline reiserfs sdl session spell sse sse-filters sse2 ssl svg tcpd truetype truetype-fonts type1-fonts udev unicode usb userland_GNU userlocales video_cards_radeon videos vorbis win32codecs winbind wma x86 xml xmms xorg xpm xscreensaver xv xvid zlib"



(Note: upload size limit is set to 16384 kB, after insertion of the required escape characters.)

Attach Files:

No files currently attached


Depends on the following items: None found

Items that depend on this one: None found


CC list is empty


There are 10 votes so far. Votes easily highlight which items people would like to see resolved in priority, independently of the priority of the item set by tracker managers.

Only logged-in users can vote.





Follows 1 latest change.

Date Changed by Updated Field Previous Value => Replaced by
2006-12-09 bakhti Carbon-Copy- => Added bakhti

Back to the top

Powered by Savane 3.9